Reaction Details
TargetSigma non-opioid intracellular receptor 1
LigandBDBM50321786
Substrate/Competitorn/a
Meas. Tech.ChEMBL_641177 (CHEMBL1174684)
Ki 3.60±n/a nM
Citation Oberdorf, CSchmidt, TJWünsch, B 5D-QSAR for spirocyclic sigma1 receptor ligands by Quasar receptor surface modeling. Eur J Med Chem45:3116-24 (2010) 
 
Sigma non-opioid intracellular receptor 1
Name:Sigma non-opioid intracellular receptor 1
Type:Protein
Mol. Mass.:25307.17
Organism:Cavia porcellus (Guinea pig)
Description:Q60492
Residue:223
BDBM50321786
NameBDBM50321786
Synonyms:(R)-1-benzyl-2'-(dimethoxymethyl)-6'-methoxy-6',7'-dihydrospiro[piperidine-4,4'-thieno[3,2-c]pyran] | CHEMBL1169778
TypeSmall organic molecule
Emp. Form.C22H29NO4S
Mol. Mass.403.535
SMILESCOC(OC)c1cc2c(C[C@H](OC)OC22CCN(Cc3ccccc3)CC2)s1