Reaction Details
TargetSigma non-opioid intracellular receptor 1
LigandBDBM50321793
Substrate/Competitorn/a
Meas. Tech.ChEMBL_641177 (CHEMBL1174684)
Ki 2.20±n/a nM
Citation Oberdorf, CSchmidt, TJWünsch, B 5D-QSAR for spirocyclic sigma1 receptor ligands by Quasar receptor surface modeling. Eur J Med Chem45:3116-24 (2010) 
 
Sigma non-opioid intracellular receptor 1
Name:Sigma non-opioid intracellular receptor 1
Type:Protein
Mol. Mass.:25307.17
Organism:Cavia porcellus (Guinea pig)
Description:Q60492
Residue:223
BDBM50321793
NameBDBM50321793
Synonyms:1'-phenyl-1-(3-phenylpropyl)-6',7'-dihydro-1'H-spiro[piperidine-4,4'-pyrano[4,3-c]pyrazole] | CHEMBL1170546
TypeSmall organic molecule
Emp. Form.C25H29N3O
Mol. Mass.387.5173
SMILESC(CN1CCC2(CC1)OCCc1c2cnn1-c1ccccc1)Cc1ccccc1