Reaction Details
TargetSigma non-opioid intracellular receptor 1
LigandBDBM50321776
Substrate/Competitorn/a
Meas. Tech.ChEMBL_641177 (CHEMBL1174684)
Ki 0.49±n/a nM
Citation Oberdorf, CSchmidt, TJWünsch, B 5D-QSAR for spirocyclic sigma1 receptor ligands by Quasar receptor surface modeling. Eur J Med Chem45:3116-24 (2010) 
 
Sigma non-opioid intracellular receptor 1
Name:Sigma non-opioid intracellular receptor 1
Type:Protein
Mol. Mass.:25307.17
Organism:Cavia porcellus (Guinea pig)
Description:Q60492
Residue:223
BDBM50321776
NameBDBM50321776
Synonyms:CHEMBL1172688 | rac-1'-butyl-3-methoxyspiro[isochroman-1,3'-piperidine]
TypeSmall organic molecule
Emp. Form.C18H27NO2
Mol. Mass.289.4125
SMILESCCCCN1CCC[C@@]2(C1)O[C@@H](Cc1ccccc21)OC