Reaction Details
TargetRAC-alpha serine/threonine-protein kinase
LigandBDBM24855
Substrate/Competitorn/a
Meas. Tech.ChEMBL_643086 (CHEMBL1176552)
IC50 2±n/a nM
Citation Freeman-Cook, KDAutry, CBorzillo, GGordon, DBarbacci-Tobin, EBernardo, VBriere, DClark, TCorbett, MJakubczak, JKakar, SKnauth, ELippa, BLuzzio, MJMansour, MMartinelli, GMarx, MNelson, KPandit, JRajamohan, FRobinson, SSubramanyam, CWei, LWythes, MMorris, J Design of selective, ATP-competitive inhibitors of Akt. J Med Chem53:4615-22 (2010) 
 
RAC-alpha serine/threonine-protein kinase
Name:RAC-alpha serine/threonine-protein kinase
Type:Enzyme
Mol. Mass.:55681.25
Organism:Homo sapiens (Human)
Description:P31749
Residue:480
BDBM24855
NameBDBM24855
Synonyms:4-{1,2-dihydrospiro[indole-3,4'-piperidine]}-7H-pyrrolo[2,3-d]pyrimidine-5-carbonitrile | pyrrolopyrimidine, 13j
TypeSmall organic molecule
Emp. Form.C19H18N6
Mol. Mass.330.3864
SMILESN#Cc1c[nH]c2ncnc(N3CC4(CCNCC4)c4ccccc34)c12