Reaction Details
TargetRAC-alpha serine/threonine-protein kinase
LigandBDBM50322397
Substrate/Competitorn/a
Meas. Tech.ChEMBL_643086 (CHEMBL1176552)
IC50 1.8±n/a nM
Citation Freeman-Cook, KDAutry, CBorzillo, GGordon, DBarbacci-Tobin, EBernardo, VBriere, DClark, TCorbett, MJakubczak, JKakar, SKnauth, ELippa, BLuzzio, MJMansour, MMartinelli, GMarx, MNelson, KPandit, JRajamohan, FRobinson, SSubramanyam, CWei, LWythes, MMorris, J Design of selective, ATP-competitive inhibitors of Akt. J Med Chem53:4615-22 (2010) 
 
RAC-alpha serine/threonine-protein kinase
Name:RAC-alpha serine/threonine-protein kinase
Type:Enzyme
Mol. Mass.:55681.25
Organism:Homo sapiens (Human)
Description:P31749
Residue:480
BDBM50322397
NameBDBM50322397
Synonyms:(S)-N-((3-amino-1-(5-ethyl-7H-pyrrolo[2,3-d]pyrimidin-4-yl)pyrrolidin-3-yl)methyl)-4-chlorobenzamide | CHEMBL1170446
TypeSmall organic molecule
Emp. Form.C20H23ClN6O
Mol. Mass.398.889
SMILESCCc1c[nH]c2ncnc(N3CC[C@](N)(CNC(=O)c4ccc(Cl)cc4)C3)c12