Reaction Details
TargetSodium-dependent noradrenaline transporter
LigandBDBM50322516
Substrate/Competitorn/a
Meas. Tech.ChEMBL_641577 (CHEMBL1176114)
IC50 2440±n/a nM
Citation Lukas, RJMuresan, AZDamaj, MIBlough, BEHuang, XNavarro, HAMascarella, SWEaton, JBMarxer-Miller, SKCarroll, FI Synthesis and characterization of in vitro and in vivo profiles of hydroxybupropion analogues: aids to smoking cessation. J Med Chem53:4731-48 (2010) 
 
Sodium-dependent noradrenaline transporter
Name:Sodium-dependent noradrenaline transporter
Type:Multi-pass membrane protein
Mol. Mass.:69337.72
Organism:Homo sapiens (Human)
Description:P23975
Residue:617
BDBM50322516
NameBDBM50322516
Synonyms:(+/-)2-(3,5-Dichlorophenyl)-3,5,5-trimethylmorpholin-2-ol | CHEMBL1173430
TypeSmall organic molecule
Emp. Form.C13H17Cl2NO2
Mol. Mass.290.186
SMILESCC1NC(C)(C)COC1(O)c1cc(Cl)cc(Cl)c1