Reaction Details
TargetSodium-dependent noradrenaline transporter
LigandBDBM50322521
Substrate/Competitorn/a
Meas. Tech.ChEMBL_641577 (CHEMBL1176114)
IC50>100000±n/a nM
Citation Lukas, RJMuresan, AZDamaj, MIBlough, BEHuang, XNavarro, HAMascarella, SWEaton, JBMarxer-Miller, SKCarroll, FI Synthesis and characterization of in vitro and in vivo profiles of hydroxybupropion analogues: aids to smoking cessation. J Med Chem53:4731-48 (2010) 
 
Sodium-dependent noradrenaline transporter
Name:Sodium-dependent noradrenaline transporter
Type:Multi-pass membrane protein
Mol. Mass.:69337.72
Organism:Homo sapiens (Human)
Description:P23975
Residue:617
BDBM50322521
NameBDBM50322521
Synonyms:(2S,3S)-2-(4-Methoxyphenyl)-3,5,5-trimethylmorpholin-2-ol | CHEMBL1173355
TypeSmall organic molecule
Emp. Form.C14H21NO3
Mol. Mass.251.3214
SMILESCOc1ccc(cc1)[C@]1(O)OCC(C)(C)N[C@H]1C