Reaction Details
TargetSodium-dependent noradrenaline transporter
LigandBDBM50322528
Substrate/Competitorn/a
Meas. Tech.ChEMBL_641577 (CHEMBL1176114)
IC50 920±n/a nM
Citation Lukas, RJMuresan, AZDamaj, MIBlough, BEHuang, XNavarro, HAMascarella, SWEaton, JBMarxer-Miller, SKCarroll, FI Synthesis and characterization of in vitro and in vivo profiles of hydroxybupropion analogues: aids to smoking cessation. J Med Chem53:4731-48 (2010) 
 
Sodium-dependent noradrenaline transporter
Name:Sodium-dependent noradrenaline transporter
Type:Multi-pass membrane protein
Mol. Mass.:69337.72
Organism:Homo sapiens (Human)
Description:P23975
Residue:617
BDBM50322528
NameBDBM50322528
Synonyms:(2S,3S)-2-(3-Bromophenyl)-3,5,5-trimethylmorpholin-2-ol | CHEMBL1173276
TypeSmall organic molecule
Emp. Form.C13H18BrNO2
Mol. Mass.300.192
SMILESC[C@@H]1NC(C)(C)CO[C@@]1(O)c1cccc(Br)c1