Reaction Details
TargetSodium-dependent noradrenaline transporter
LigandBDBM50322511
Substrate/Competitorn/a
Meas. Tech.ChEMBL_641577 (CHEMBL1176114)
IC50 415±n/a nM
Citation Lukas, RJMuresan, AZDamaj, MIBlough, BEHuang, XNavarro, HAMascarella, SWEaton, JBMarxer-Miller, SKCarroll, FI Synthesis and characterization of in vitro and in vivo profiles of hydroxybupropion analogues: aids to smoking cessation. J Med Chem53:4731-48 (2010) 
 
Sodium-dependent noradrenaline transporter
Name:Sodium-dependent noradrenaline transporter
Type:Multi-pass membrane protein
Mol. Mass.:69337.72
Organism:Homo sapiens (Human)
Description:P23975
Residue:617
BDBM50322511
NameBDBM50322511
Synonyms:(2S,3S)-2-(3-Chlorophenyl)-3,4,5,5-tetramethylmorpholin-2-ol | CHEMBL1171260
TypeSmall organic molecule
Emp. Form.C14H20ClNO2
Mol. Mass.269.767
SMILESC[C@@H]1N(C)C(C)(C)CO[C@@]1(O)c1cccc(Cl)c1