Reaction Details
TargetSodium-dependent serotonin transporter
LigandBDBM50322525
Substrate/Competitorn/a
Meas. Tech.ChEMBL_641578 (CHEMBL1176115)
IC50>100000±n/a nM
Citation Lukas, RJMuresan, AZDamaj, MIBlough, BEHuang, XNavarro, HAMascarella, SWEaton, JBMarxer-Miller, SKCarroll, FI Synthesis and characterization of in vitro and in vivo profiles of hydroxybupropion analogues: aids to smoking cessation. J Med Chem53:4731-48 (2010) 
 
Sodium-dependent serotonin transporter
Name:Sodium-dependent serotonin transporter
Type:Multi-pass membrane protein
Mol. Mass.:70322.51
Organism:Homo sapiens (Human)
Description:P31645
Residue:630
BDBM50322525
NameBDBM50322525
Synonyms:(2S,3S)-2-(3-Nitrophenyl)-3,5,5-trimethylmorpholin-2-ol | CHEMBL1173280
TypeSmall organic molecule
Emp. Form.C13H18N2O4
Mol. Mass.266.293
SMILESC[C@@H]1NC(C)(C)CO[C@@]1(O)c1cccc(c1)[N+]([O-])=O