Reaction Details
TargetSodium-dependent serotonin transporter
LigandBDBM50322515
Substrate/Competitorn/a
Meas. Tech.ChEMBL_641578 (CHEMBL1176115)
IC50 1565±n/a nM
Citation Lukas, RJMuresan, AZDamaj, MIBlough, BEHuang, XNavarro, HAMascarella, SWEaton, JBMarxer-Miller, SKCarroll, FI Synthesis and characterization of in vitro and in vivo profiles of hydroxybupropion analogues: aids to smoking cessation. J Med Chem53:4731-48 (2010) 
 
Sodium-dependent serotonin transporter
Name:Sodium-dependent serotonin transporter
Type:Multi-pass membrane protein
Mol. Mass.:70322.51
Organism:Homo sapiens (Human)
Description:P31645
Residue:630
BDBM50322515
NameBDBM50322515
Synonyms:(2S,3S)-2-(Naphthalen-1-yl)-3,5,5-trimethylmorpholin-2-ol | CHEMBL1173770
TypeSmall organic molecule
Emp. Form.C23H25NO2
Mol. Mass.347.4501
SMILESC[C@@H]1NC(C)(C)CO[C@@]1(O)c1cccc(c1)-c1cccc2ccccc12