Reaction Details
TargetSodium-dependent dopamine transporter
LigandBDBM50322523
Substrate/Competitorn/a
Meas. Tech.ChEMBL_641576 (CHEMBL1176113)
IC50 285±n/a nM
Citation Lukas, RJMuresan, AZDamaj, MIBlough, BEHuang, XNavarro, HAMascarella, SWEaton, JBMarxer-Miller, SKCarroll, FI Synthesis and characterization of in vitro and in vivo profiles of hydroxybupropion analogues: aids to smoking cessation. J Med Chem53:4731-48 (2010) 
 
Sodium-dependent dopamine transporter
Name:Sodium-dependent dopamine transporter
Type:Multi-pass membrane protein
Mol. Mass.:68497.11
Organism:Homo sapiens (Human)
Description:Q01959
Residue:620
BDBM50322523
NameBDBM50322523
Synonyms:(2S,3S)-2-(4-Chlorophenyl)-3,5,5-trimethylmorpholin-2-ol | CHEMBL1173354
TypeSmall organic molecule
Emp. Form.C13H18ClNO2
Mol. Mass.255.741
SMILESC[C@@H]1NC(C)(C)CO[C@@]1(O)c1ccc(Cl)cc1