Reaction Details
TargetNeuronal acetylcholine receptor subunit alpha-4/beta-4
LigandBDBM50322524
Substrate/Competitorn/a
Meas. Tech.ChEMBL_641587 (CHEMBL1176289)
IC50>100000±n/a nM
Citation Lukas, RJMuresan, AZDamaj, MIBlough, BEHuang, XNavarro, HAMascarella, SWEaton, JBMarxer-Miller, SKCarroll, FI Synthesis and characterization of in vitro and in vivo profiles of hydroxybupropion analogues: aids to smoking cessation. J Med Chem53:4731-48 (2010) 
 
Neuronal acetylcholine receptor subunit alpha-4/beta-4
Name:Neuronal acetylcholine receptor subunit alpha-4/beta-4
Type:n/a
Mol. Mass.:n/a
Description:ASSAY_ID of EBI is 143890
Components:This complex has 2 components.
Component 1
Name:Neuronal acetylcholine receptor subunit beta-4
Synonyms:ACHB4_HUMAN Cholinergic, Nicotinic Alpha6Beta3Beta4Alpha5 Nicotinic acetylcholine receptor alpha6/alpha3/beta4
Type:Enzyme Catalytic Domain
Mol. Mass.:56388.51
Organism:Homo sapiens (Human)
Description:Cholinergic, Nicotinic Alpha6Beta3Beta4Alpha5 0 HUMAN::P30926
Residue:498
Component 2
Name:Neuronal acetylcholine receptor subunit alpha-4
Synonyms:ACHA4_HUMAN CHRNA4 protein Neuronal acetylcholine receptor protein alpha-4 subunit Nicotinic acetylcholine receptor alpha4/beta2/alpha5
Type:n/a
Mol. Mass.:69963.49
Organism:Homo sapiens (Human)
Description:NACHRA4
Residue:627
BDBM50322524
NameBDBM50322524
Synonyms:(2S,3S)-2-(4-Fluorophenyl)-3,5,5-trimethylmorpholin-2-ol | CHEMBL1173353
TypeSmall organic molecule
Emp. Form.C13H18FNO2
Mol. Mass.239.2859
SMILESC[C@@H]1NC(C)(C)CO[C@@]1(O)c1ccc(F)cc1