Reaction Details
TargetGlycogen synthase kinase-3 beta
LigandBDBM50322828
Substrate/Competitorn/a
Meas. Tech.ChEMBL_644429 (CHEMBL1211213)
IC50 365±n/a nM
Citation Ibrahim, NMouawad, LLegraverend, M Novel 8-arylated purines as inhibitors of glycogen synthase kinase. Eur J Med Chem45:3389-93 (2010) 
 
Glycogen synthase kinase-3 beta
Name:Glycogen synthase kinase-3 beta
Type:Enzyme
Mol. Mass.:46756.38
Organism:Homo sapiens (Human)
Description:P49841
Residue:420
BDBM50322828
NameBDBM50322828
Synonyms:CHEMBL1210310 | N-(8-(3-chlorophenyl)-9H-purin-6-yl)cyclopropanecarboxamide
TypeSmall organic molecule
Emp. Form.C15H12ClN5O
Mol. Mass.313.742
SMILESClc1cccc(c1)-c1nc2ncnc(NC(=O)C3CC3)c2[nH]1