Reaction Details
TargetAdenosine receptor A2b
LigandBDBM50254264
Substrate/Competitorn/a
Meas. Tech.ChEMBL_644535 (CHEMBL1211412)
Ki 836±n/a nM
Citation Cheng, FXu, ZLiu, GTang, Y Insights into binding modes of adenosine A(2B) antagonists with ligand-based and receptor-based methods. Eur J Med Chem45:3459-71 (2010) 
 
Adenosine receptor A2b
Name:Adenosine receptor A2b
Type:G Protein-Coupled Receptor (GPCR)
Mol. Mass.:36341.22
Organism:Homo sapiens (Human)
Description:n/a
Residue:332
BDBM50254264
NameBDBM50254264
Synonyms:3-(2-Fluorobenzyl)-7-(2-oxazolyl)-3H-[1,2,3]triazolo[4,5-d]pyrimidine-5-amine CHEMBL468701
TypeSmall organic molecule
Emp. Form.C14H10FN7O
Mol. Mass.311.2739
SMILESNc1nc(-c2ncco2)c2nnn(Cc3ccccc3F)c2n1