Reaction Details
TargetAdenosine receptor A2a
LigandBDBM50190706
Substrate/Competitorn/a
Meas. Tech.ChEMBL_644536 (CHEMBL1211413)
Ki 162±n/a nM
Citation Cheng, FXu, ZLiu, GTang, Y Insights into binding modes of adenosine A(2B) antagonists with ligand-based and receptor-based methods. Eur J Med Chem45:3459-71 (2010) 
 
Adenosine receptor A2a
Name:Adenosine receptor A2a
Type:G Protein-Coupled Receptor (GPCR)
Mol. Mass.:44716.46
Organism:Homo sapiens (Human)
Description:P29274
Residue:412
BDBM50190706
NameBDBM50190706
Synonyms:8-[4-(benzylamidosulfonyl)phenyl]-1-propylxanthine N-benzyl-4-(2,6-dioxo-1-propyl-2,3,6,7-tetrahydro-1H-purin-8-yl)benzenesulfonamide
TypeSmall organic molecule
Emp. Form.C21H21N5O4S
Mol. Mass.439.488
SMILESCCCn1c(=O)[nH]c2nc([nH]c2c1=O)-c1ccc(cc1)S(=O)(=O)NCc1ccccc1