Reaction Details
TargetAdenosine receptor A2a
LigandBDBM50086173
Substrate/Competitorn/a
Meas. Tech.ChEMBL_644536 (CHEMBL1211413)
Ki 112±n/a nM
Citation Cheng, FXu, ZLiu, GTang, Y Insights into binding modes of adenosine A(2B) antagonists with ligand-based and receptor-based methods. Eur J Med Chem45:3459-71 (2010) 
 
Adenosine receptor A2a
Name:Adenosine receptor A2a
Type:G Protein-Coupled Receptor (GPCR)
Mol. Mass.:44716.46
Organism:Homo sapiens (Human)
Description:P29274
Residue:412
BDBM50086173
NameBDBM50086173
Synonyms:CHEMBL17002 N-(4-acetylphenyl)-2-(4-(2,6-dioxo-1,3-dipropyl-2,3,6,7-tetrahydro-1H-purin-8-yl)phenoxy)acetamide
TypeSmall organic molecule
Emp. Form.C27H29N5O5
Mol. Mass.503.5497
SMILESCCCn1c2nc([nH]c2c(=O)n(CCC)c1=O)-c1ccc(OCC(=O)Nc2ccc(cc2)C(C)=O)cc1