Reaction Details
TargetCholecystokinin receptor type A
LigandBDBM50323040
Substrate/Competitorn/a
Meas. Tech.ChEMBL_643607 (CHEMBL1212471)
IC50 1±n/a nM
Citation Gattinoni, SSimone, CDDallavalle, SFezza, FNannei, RBattista, NMinetti, PQuattrociocchi, GCaprioli, ABorsini, FCabri, WPenco, SMerlini, LMaccarrone, M A new group of oxime carbamates as reversible inhibitors of fatty acid amide hydrolase. Bioorg Med Chem Lett20:4406-11 (2010) 
 
Cholecystokinin receptor type A
Name:Cholecystokinin receptor type A
Type:G Protein-Coupled Receptor (GPCR)
Mol. Mass.:47859.34
Organism:Homo sapiens (Human)
Description:Stable expression of human CCK-1 receptors in HEK 293 cells.
Residue:428
BDBM50323040
NameBDBM50323040
Synonyms:1-(3-Thiophen-2-yl-phenyl)-ethanone, O-(phenylaminocarbonyl)oxime | CHEMBL1210154
TypeSmall organic molecule
Emp. Form.C19H16N2O2S
Mol. Mass.336.408
SMILESCC(=NOC(=O)Nc1ccccc1)c1cccc(c1)-c1cccs1