Reaction Details
TargetFatty-acid amide hydrolase 1
LigandBDBM50323049
Substrate/Competitorn/a
Meas. Tech.ChEMBL_643589 (CHEMBL1212453)
IC50 28±n/a nM
Citation Gattinoni, SSimone, CDDallavalle, SFezza, FNannei, RBattista, NMinetti, PQuattrociocchi, GCaprioli, ABorsini, FCabri, WPenco, SMerlini, LMaccarrone, M A new group of oxime carbamates as reversible inhibitors of fatty acid amide hydrolase. Bioorg Med Chem Lett20:4406-11 (2010) 
 
Fatty-acid amide hydrolase 1
Name:Fatty-acid amide hydrolase 1
Type:Hydrolase; single-pass membrane protein; homodimer
Mol. Mass.:63227.28
Organism:Mus musculus (mouse)
Description:Mouse brain membranes were used in the assay.
Residue:579
BDBM50323049
NameBDBM50323049
Synonyms:1-Biphenyl-3-yl-ethanone, O-(4-methoxyphenylaminocarbonyl)oxime | CHEMBL1210093
TypeSmall organic molecule
Emp. Form.C22H20N2O3
Mol. Mass.360.4058
SMILESCOc1ccc(NC(=O)ON=C(C)c2cccc(c2)-c2ccccc2)cc1