Reaction Details
TargetOrnithine decarboxylase
LigandBDBM50005727
Substrate/Competitorn/a
Meas. Tech.ChEMBL_643973 (CHEMBL1211872)
IC50 39±n/a nM
Citation Klee, NWong, PEBaragaña, BMazouni, FEPhillips, MABarrett, MPGilbert, IH Selective delivery of 2-hydroxy APA to Trypanosoma brucei using the melamine motif. Bioorg Med Chem Lett20:4364-6 (2010) 
 
Ornithine decarboxylase
Name:Ornithine decarboxylase
Type:PROTEIN
Mol. Mass.:51037.04
Organism:Rattus norvegicus
Description:ChEMBL_1344641
Residue:461
BDBM50005727
NameBDBM50005727
Synonyms:1-Amino-3-aminooxy-propan-2-ol | CHEMBL26857
TypeSmall organic molecule
Emp. Form.C3H10N2O2
Mol. Mass.106.1237
SMILESNCC(O)CON