Reaction Details
TargetHigh affinity choline transporter 1
LigandBDBM50147105
Substrate/Competitorn/a
Meas. Tech.ChEMBL_644789 (CHEMBL1211032)
Ki 310455.96±n/a nM
Citation Geldenhuys, WJAllen, DDLockman, PR 3-D-QSAR and docking studies on the neuronal choline transporter. Bioorg Med Chem Lett20:4870-7 (2010) 
 
High affinity choline transporter 1
Name:High affinity choline transporter 1
Type:PROTEIN
Mol. Mass.:63358.06
Organism:Mus musculus
Description:ChEMBL_644789
Residue:580
BDBM50147105
NameBDBM50147105
Synonyms:(4-Hydroxy-butyl)-trimethyl-ammonium CHEMBL1209423
TypeSmall organic molecule
Emp. Form.C7H18NO
Mol. Mass.132.2234
SMILESC[N+](C)(C)CCCCO