Reaction Details
TargetHigh affinity choline transporter 1
LigandBDBM50416483
Substrate/Competitorn/a
Meas. Tech.ChEMBL_644789 (CHEMBL1211032)
Ki 290402.27±n/a nM
Citation Geldenhuys, WJAllen, DDLockman, PR 3-D-QSAR and docking studies on the neuronal choline transporter. Bioorg Med Chem Lett20:4870-7 (2010) 
 
High affinity choline transporter 1
Name:High affinity choline transporter 1
Type:PROTEIN
Mol. Mass.:63358.06
Organism:Mus musculus
Description:ChEMBL_644789
Residue:580
BDBM50416483
NameBDBM50416483
Synonyms:CHEMBL1209424
TypeSmall organic molecule
Emp. Form.C5H13NO
Mol. Mass.103.1628
SMILESCN(C)CCCO