Reaction Details
TargetHigh affinity choline transporter 1
LigandBDBM50416484
Substrate/Competitorn/a
Meas. Tech.ChEMBL_644789 (CHEMBL1211032)
Ki 190107.83±n/a nM
Citation Geldenhuys, WJAllen, DDLockman, PR 3-D-QSAR and docking studies on the neuronal choline transporter. Bioorg Med Chem Lett20:4870-7 (2010) 
 
High affinity choline transporter 1
Name:High affinity choline transporter 1
Type:PROTEIN
Mol. Mass.:63358.06
Organism:Mus musculus
Description:ChEMBL_644789
Residue:580
BDBM50416484
NameBDBM50416484
Synonyms:CHEMBL1209503
TypeSmall organic molecule
Emp. Form.C8H18NO2
Mol. Mass.160.2335
SMILESCC(=O)OCCC[N+](C)(C)C