Reaction Details
TargetHigh affinity choline transporter 1
LigandBDBM50416487
Substrate/Competitorn/a
Meas. Tech.ChEMBL_644789 (CHEMBL1211032)
Ki 1051961.87±n/a nM
Citation Geldenhuys, WJAllen, DDLockman, PR 3-D-QSAR and docking studies on the neuronal choline transporter. Bioorg Med Chem Lett20:4870-7 (2010) 
 
High affinity choline transporter 1
Name:High affinity choline transporter 1
Type:PROTEIN
Mol. Mass.:63358.06
Organism:Mus musculus
Description:ChEMBL_644789
Residue:580
BDBM50416487
NameBDBM50416487
Synonyms:CHEMBL1236196 | TETRABUTYLAMMONIUM
TypeSmall organic molecule
Emp. Form.C16H36N
Mol. Mass.242.4632
SMILESCCCC[N+](CCCC)(CCCC)CCCC