Reaction Details
TargetHigh affinity choline transporter 1
LigandBDBM50416495
Substrate/Competitorn/a
Meas. Tech.ChEMBL_644789 (CHEMBL1211032)
Ki 40086.67±n/a nM
Citation Geldenhuys, WJAllen, DDLockman, PR 3-D-QSAR and docking studies on the neuronal choline transporter. Bioorg Med Chem Lett20:4870-7 (2010) 
 
High affinity choline transporter 1
Name:High affinity choline transporter 1
Type:PROTEIN
Mol. Mass.:63358.06
Organism:Mus musculus
Description:ChEMBL_644789
Residue:580
BDBM50416495
NameBDBM50416495
Synonyms:CHEMBL1209648
TypeSmall organic molecule
Emp. Form.C7H13N
Mol. Mass.111.1848
SMILESC1CN2CCC1CC2