Reaction Details
TargetHigh affinity choline transporter 1
LigandBDBM50416506
Substrate/Competitorn/a
Meas. Tech.ChEMBL_644789 (CHEMBL1211032)
Ki 521.19±n/a nM
Citation Geldenhuys, WJAllen, DDLockman, PR 3-D-QSAR and docking studies on the neuronal choline transporter. Bioorg Med Chem Lett20:4870-7 (2010) 
 
High affinity choline transporter 1
Name:High affinity choline transporter 1
Type:PROTEIN
Mol. Mass.:63358.06
Organism:Mus musculus
Description:ChEMBL_644789
Residue:580
BDBM50416506
NameBDBM50416506
Synonyms:CHEMBL1209581
TypeSmall organic molecule
Emp. Form.C8H14NO
Mol. Mass.140.2023
SMILESC[N+]12CCC(CC1)C(=O)C2