Reaction Details
TargetHigh affinity choline transporter 1
LigandBDBM50416507
Substrate/Competitorn/a
Meas. Tech.ChEMBL_644789 (CHEMBL1211032)
Ki 72110.75±n/a nM
Citation Geldenhuys, WJAllen, DDLockman, PR 3-D-QSAR and docking studies on the neuronal choline transporter. Bioorg Med Chem Lett20:4870-7 (2010) 
 
High affinity choline transporter 1
Name:High affinity choline transporter 1
Type:PROTEIN
Mol. Mass.:63358.06
Organism:Mus musculus
Description:ChEMBL_644789
Residue:580
BDBM50416507
NameBDBM50416507
Synonyms:CHEMBL1209649
TypeSmall organic molecule
Emp. Form.C8H16NO
Mol. Mass.142.2182
SMILESC[N+]12CCC(O)(CC1)CC2