Reaction Details
TargetProtein phosphatase 3 catalytic subunit alpha
LigandBDBM50323716
Substrate/Competitorn/a
Meas. Tech.ChEMBL_647718 (CHEMBL1220315)
IC50 49±n/a nM
Citation Zhang, YErdmann, FFischer, G Augmented photoswitching modulates immune signaling. Nat Chem Biol5:724-6 (2009) 
 
Protein phosphatase 3 catalytic subunit alpha
Name:Protein phosphatase 3 catalytic subunit alpha
Type:Enzyme Catalytic Domain
Mol. Mass.:58681.14
Organism:Homo sapiens (Human)
Description:calcineurin 0 HUMAN::Q08209
Residue:521
BDBM50323716
NameBDBM50323716
Synonyms:2-(((2R,5S,8S,11S,14S,17S,23S,26S,29S,32S)-17-ethyl-14-((1R,2R,E)-1-hydroxy-2-methylhex-4-enyl)-5,8,23,29-tetraisobutyl-11,26-diisopropyl-4,7,10,13,19,22,28,32-octamethyl-3,6,9,12,15,18,21,24,27,30,33-undecaoxo-1,4,7,10,13,16,19,22,25,28,31-undecaazacyclotritriacontan-2-yl)methoxy)-N-(4-((E)-phenyldiazenyl)phenyl)acetamide | CHEMBL1213209
TypeSmall organic molecule
Emp. Form.C76H122N14O14
Mol. Mass.1455.8673
SMILESCC[C@@H]1NC(=O)[C@H]([C@H](O)[C@H](C)C\C=C\C)N(C)C(=O)[C@H](C(C)C)N(C)C(=O)[C@H](CC(C)C)N(C)C(=O)[C@H](CC(C)C)N(C)C(=O)[C@@H](COCC(=O)Nc2ccc(cc2)\N=N\c2ccccc2)NC(=O)[C@H](C)NC(=O)[C@H](CC(C)C)N(C)C(=O)[C@@H](NC(=O)[C@H](CC(C)C)N(C)C(=O)CN(C)C1=O)C(C)C