Reaction Details
TargetPhosphatidylinositol 4,5-bisphosphate 3-kinase catalytic subunit alpha isoform
LigandBDBM50323730
Substrate/Competitorn/a
Meas. Tech.ChEMBL_646799 (CHEMBL1216940)
IC50 85000±n/a nM
Citation Berndt, AMiller, SWilliams, OLe, DDHouseman, BTPacold, JIGorrec, FHon, WCLiu, YRommel, CGaillard, PRückle, TSchwarz, MKShokat, KMShaw, JPWilliams, RL The p110 delta structure: mechanisms for selectivity and potency of new PI(3)K inhibitors. Nat Chem Biol6:117-24 (2010) 
 
Phosphatidylinositol 4,5-bisphosphate 3-kinase catalytic subunit alpha isoform
Name:Phosphatidylinositol 4,5-bisphosphate 3-kinase catalytic subunit alpha isoform
Type:Enzyme Subunit
Mol. Mass.:124294.87
Organism:Homo sapiens (Human)
Description:P42336
Residue:1068
BDBM50323730
NameBDBM50323730
Synonyms:2-((4-amino-3-(3-hydroxyprop-1-ynyl)-1H-pyrazolo[3,4-d]pyrimidin-1-yl)methyl)-5-methyl-3-o-tolylquinazolin-4(3H)-one CHEMBL1213116
TypeSmall organic molecule
Emp. Form.C25H21N7O2
Mol. Mass.451.4799
SMILESCc1ccccc1-n1c(Cn2nc(C#CCO)c3c(N)ncnc23)nc2cccc(C)c2c1=O