Reaction Details
TargetPhosphatidylinositol 4,5-bisphosphate 3-kinase catalytic subunit beta isoform
LigandBDBM50323733
Substrate/Competitorn/a
Meas. Tech.ChEMBL_646800 (CHEMBL1216941)
IC50 664±n/a nM
Citation Berndt, AMiller, SWilliams, OLe, DDHouseman, BTPacold, JIGorrec, FHon, WCLiu, YRommel, CGaillard, PRückle, TSchwarz, MKShokat, KMShaw, JPWilliams, RL The p110 delta structure: mechanisms for selectivity and potency of new PI(3)K inhibitors. Nat Chem Biol6:117-24 (2010) 
 
Phosphatidylinositol 4,5-bisphosphate 3-kinase catalytic subunit beta isoform
Name:Phosphatidylinositol 4,5-bisphosphate 3-kinase catalytic subunit beta isoform
Type:Enzyme Subunit
Mol. Mass.:122769.00
Organism:Homo sapiens (Human)
Description:P42338
Residue:1070
BDBM50323733
NameBDBM50323733
Synonyms:1-(1-METHYLETHYL)-3-(PYRIDIN-3-YLETHYNYL)-1H-PYRAZOLO[3,4-D]PYRIMIDIN-4-AMINE CHEMBL1213119
TypeSmall organic molecule
Emp. Form.C15H14N6
Mol. Mass.278.3119
SMILESCC(C)n1nc(C#Cc2cccnc2)c2c(N)ncnc12