Reaction Details
TargetCarbonic anhydrase 3
LigandBDBM50323739
Substrate/Competitorn/a
Meas. Tech.ChEMBL_646955 (CHEMBL1217096)
Ki 520±n/a nM
Citation Carta, FTemperini, CInnocenti, AScozzafava, AKaila, KSupuran, CT Polyamines inhibit carbonic anhydrases by anchoring to the zinc-coordinated water molecule. J Med Chem53:5511-22 (2010) 
 
Carbonic anhydrase 3
Name:Carbonic anhydrase 3
Type:Enzyme
Mol. Mass.:29562.11
Organism:Homo sapiens (Human)
Description:Human cloned isozyme.
Residue:260
BDBM50323739
NameBDBM50323739
Synonyms:CHEMBL1214194 | N1,N1'-(ethane-1,2-diyl)bis(N1,N2,N2-trimethylethane-1,2-diamine)
TypeSmall organic molecule
Emp. Form.C12H30N4
Mol. Mass.230.3934
SMILESCN(C)CCN(C)CCN(C)CCN(C)C