Reaction Details
TargetCarbonic anhydrase 6
LigandBDBM50323739
Substrate/Competitorn/a
Meas. Tech.ChEMBL_646959 (CHEMBL1217100)
Ki 780±n/a nM
Citation Carta, FTemperini, CInnocenti, AScozzafava, AKaila, KSupuran, CT Polyamines inhibit carbonic anhydrases by anchoring to the zinc-coordinated water molecule. J Med Chem53:5511-22 (2010) 
 
Carbonic anhydrase 6
Name:Carbonic anhydrase 6
Type:Enzyme
Mol. Mass.:35371.40
Organism:Homo sapiens (Human)
Description:P23280
Residue:308
BDBM50323739
NameBDBM50323739
Synonyms:CHEMBL1214194 | N1,N1'-(ethane-1,2-diyl)bis(N1,N2,N2-trimethylethane-1,2-diamine)
TypeSmall organic molecule
Emp. Form.C12H30N4
Mol. Mass.230.3934
SMILESCN(C)CCN(C)CCN(C)CCN(C)C