Reaction Details
TargetCarbonic anhydrase 3
LigandBDBM50323740
Substrate/Competitorn/a
Meas. Tech.ChEMBL_646955 (CHEMBL1217096)
Ki 600±n/a nM
Citation Carta, FTemperini, CInnocenti, AScozzafava, AKaila, KSupuran, CT Polyamines inhibit carbonic anhydrases by anchoring to the zinc-coordinated water molecule. J Med Chem53:5511-22 (2010) 
 
Carbonic anhydrase 3
Name:Carbonic anhydrase 3
Type:Enzyme
Mol. Mass.:29562.11
Organism:Homo sapiens (Human)
Description:Human cloned isozyme.
Residue:260
BDBM50323740
NameBDBM50323740
Synonyms:CHEMBL303004
TypeSmall organic molecule
Emp. Form.C6H16N2
Mol. Mass.116.2046
SMILESNCCCCCCN