Reaction Details
TargetCarbonic anhydrase 5B, mitochondrial
LigandBDBM50323740
Substrate/Competitorn/a
Meas. Tech.ChEMBL_646958 (CHEMBL1217099)
Ki 580±n/a nM
Citation Carta, FTemperini, CInnocenti, AScozzafava, AKaila, KSupuran, CT Polyamines inhibit carbonic anhydrases by anchoring to the zinc-coordinated water molecule. J Med Chem53:5511-22 (2010) 
 
Carbonic anhydrase 5B, mitochondrial
Name:Carbonic anhydrase 5B, mitochondrial
Type:Enzyme
Mol. Mass.:36440.83
Organism:Homo sapiens (Human)
Description:Human (cloned) isozyme
Residue:317
BDBM50323740
NameBDBM50323740
Synonyms:CHEMBL303004
TypeSmall organic molecule
Emp. Form.C6H16N2
Mol. Mass.116.2046
SMILESNCCCCCCN