Reaction Details
TargetCarbonic anhydrase 4
LigandBDBM50323741
Substrate/Competitorn/a
Meas. Tech.ChEMBL_646956 (CHEMBL1217097)
Ki 52±n/a nM
Citation Carta, FTemperini, CInnocenti, AScozzafava, AKaila, KSupuran, CT Polyamines inhibit carbonic anhydrases by anchoring to the zinc-coordinated water molecule. J Med Chem53:5511-22 (2010) 
 
Carbonic anhydrase 4
Name:Carbonic anhydrase 4
Type:Enzyme
Mol. Mass.:35037.98
Organism:Homo sapiens (Human)
Description:P22748
Residue:312
BDBM50323741
NameBDBM50323741
Synonyms:CHEMBL119296
TypeSmall organic molecule
Emp. Form.C5H14N2
Mol. Mass.102.1781
SMILESNCCCCCN