Reaction Details
TargetCarbonic anhydrase 5B, mitochondrial
LigandBDBM50323741
Substrate/Competitorn/a
Meas. Tech.ChEMBL_646958 (CHEMBL1217099)
Ki 540±n/a nM
Citation Carta, FTemperini, CInnocenti, AScozzafava, AKaila, KSupuran, CT Polyamines inhibit carbonic anhydrases by anchoring to the zinc-coordinated water molecule. J Med Chem53:5511-22 (2010) 
 
Carbonic anhydrase 5B, mitochondrial
Name:Carbonic anhydrase 5B, mitochondrial
Type:Enzyme
Mol. Mass.:36440.83
Organism:Homo sapiens (Human)
Description:Human (cloned) isozyme
Residue:317
BDBM50323741
NameBDBM50323741
Synonyms:CHEMBL119296
TypeSmall organic molecule
Emp. Form.C5H14N2
Mol. Mass.102.1781
SMILESNCCCCCN