Reaction Details
TargetCarbonic anhydrase 9
LigandBDBM50323743
Substrate/Competitorn/a
Meas. Tech.ChEMBL_646961 (CHEMBL1217102)
Ki 510±n/a nM
Citation Carta, FTemperini, CInnocenti, AScozzafava, AKaila, KSupuran, CT Polyamines inhibit carbonic anhydrases by anchoring to the zinc-coordinated water molecule. J Med Chem53:5511-22 (2010) 
 
Carbonic anhydrase 9
Name:Carbonic anhydrase 9
Type:Enzyme
Mol. Mass.:49669.03
Organism:Homo sapiens (Human)
Description:Catalytic domain of human cloned isozyme was used in the assay
Residue:459
BDBM50323743
NameBDBM50323743
Synonyms:CHEMBL1214195 | N1-(naphthalen-1-yl)ethane-1,2-diamine
TypeSmall organic molecule
Emp. Form.C12H14N2
Mol. Mass.186.253
SMILESNCCNc1cccc2ccccc12