Reaction Details
TargetCarbonic anhydrase 4
LigandBDBM50323744
Substrate/Competitorn/a
Meas. Tech.ChEMBL_646956 (CHEMBL1217097)
Ki 116±n/a nM
Citation Carta, FTemperini, CInnocenti, AScozzafava, AKaila, KSupuran, CT Polyamines inhibit carbonic anhydrases by anchoring to the zinc-coordinated water molecule. J Med Chem53:5511-22 (2010) 
 
Carbonic anhydrase 4
Name:Carbonic anhydrase 4
Type:Enzyme
Mol. Mass.:35037.98
Organism:Homo sapiens (Human)
Description:P22748
Residue:312
BDBM50323744
NameBDBM50323744
Synonyms:CHEMBL1214248 | N1,N12-Bis(trifluoroacetyl)spermine Bis Trifluoroacetate
TypeSmall organic molecule
Emp. Form.C14H24F6N4O2
Mol. Mass.394.3564
SMILESFC(F)(F)C(=O)NCCCNCCCCNCCCNC(=O)C(F)(F)F