Reaction Details
TargetCarbonic anhydrase 15
LigandBDBM10883
Substrate/Competitorn/a
Meas. Tech.ChEMBL_646965 (CHEMBL1217106)
Ki 95±n/a nM
Citation Carta, FTemperini, CInnocenti, AScozzafava, AKaila, KSupuran, CT Polyamines inhibit carbonic anhydrases by anchoring to the zinc-coordinated water molecule. J Med Chem53:5511-22 (2010) 
 
Carbonic anhydrase 15
Name:Carbonic anhydrase 15
Type:PROTEIN
Mol. Mass.:35484.02
Organism:Mus musculus
Description:ChEMBL_651955
Residue:324
BDBM10883
NameBDBM10883
Synonyms:4,5-dichlorobenzene-1,3-disulfonamide Dichlorophenamide Dichlorophenamide, DCP US10172837, Dichlorphenamide | sulfonamide 4
TypeSmall organic molecule
Emp. Form.C6H6Cl2N2O4S2
Mol. Mass.305.159
SMILESNS(=O)(=O)c1cc(Cl)c(Cl)c(c1)S(N)(=O)=O