Reaction Details
TargetHeat shock protein HSP 90-alpha
LigandBDBM50323779
Substrate/Competitorn/a
Meas. Tech.ChEMBL_647264 (CHEMBL1217470)
IC50 1400±n/a nM
Citation Sekiguchi, HMuranaka, KOsada, AIchikawa, SMatsuda, A Efficient synthesis of Hsp90 inhibitor dimers as potential antitumor agents. Bioorg Med Chem18:5732-7 (2010) 
 
Heat shock protein HSP 90-alpha
Name:Heat shock protein HSP 90-alpha
Type:Molecular Chaperone
Mol. Mass.:84623.45
Organism:Homo sapiens (Human)
Description:P07900
Residue:732
BDBM50323779
NameBDBM50323779
Synonyms:8-(6-bromobenzo[d][1,3]dioxol-5-ylthio)-9-(hex-5-ynyl)-9H-purin-6-amine | CHEMBL1213891
TypeSmall organic molecule
Emp. Form.C18H16BrN5O2S
Mol. Mass.446.321
SMILESNc1ncnc2n(CCCCC#C)c(Sc3cc4OCOc4cc3Br)nc12