Reaction Details
TargetAmine oxidase [flavin-containing] A
LigandBDBM29136
Substrate/Competitorn/a
Meas. Tech.ChEMBL_647382 (CHEMBL1217543)
IC50 6560±n/a nM
Citation Chimenti, FBolasco, ASecci, DChimenti, PGranese, ACarradori, SYáñez, MOrallo, FOrtuso, FAlcaro, S Investigations on the 2-thiazolylhydrazyne scaffold: synthesis and molecular modeling of selective human monoamine oxidase inhibitors. Bioorg Med Chem18:5715-23 (2010) 
 
Amine oxidase [flavin-containing] A
Name:Amine oxidase [flavin-containing] A
Type:Protein
Mol. Mass.:59689.53
Organism:Homo sapiens (Human)
Description:P21397
Residue:527
BDBM29136
NameBDBM29136
Synonyms:CHEMBL92401 Iprazid | Iproniazid
TypeSmall organic molecule
Emp. Form.C9H13N3O
Mol. Mass.179.219
SMILESCC(C)NNC(=O)c1ccncc1