Reaction Details
TargetEstrogen receptor
LigandBDBM50323911
Substrate/Competitorn/a
Meas. Tech.ChEMBL_647642 (CHEMBL1219993)
Ki 46.29±n/a nM
Citation Rivera-Guevara, CPérez-Alvarez, VGarcía-Becerra, ROrdaz-Rosado, DMorales-Ríos, MSHernández-Gallegos, ECooney, AJBravo-Gómez, MELarrea, FCamacho, J Genomic action of permanently charged tamoxifen derivatives via estrogen receptor-alpha. Bioorg Med Chem18:5593-601 (2010) 
 
Estrogen receptor
Name:Estrogen receptor
Type:Protein
Mol. Mass.:66230.44
Organism:Homo sapiens (Human)
Description:P03372
Residue:595
BDBM50323911
NameBDBM50323911
Synonyms:CHEMBL1213783 | Tamoxifen methyl iodide
TypeSmall organic molecule
Emp. Form.C27H32NO
Mol. Mass.386.5485
SMILESCC\C(=C(/c1ccccc1)c1ccc(OCC[N+](C)(C)C)cc1)c1ccccc1