Reaction Details
TargetSerine/threonine-protein kinase B-raf
LigandBDBM50323916
Substrate/Competitorn/a
Meas. Tech.ChEMBL_647650 (CHEMBL1220001)
IC50>100000±n/a nM
Citation Dietrich, JHulme, CHurley, LH The design, synthesis, and evaluation of 8 hybrid DFG-out allosteric kinase inhibitors: a structural analysis of the binding interactions of Gleevec, Nexavar, and BIRB-796. Bioorg Med Chem18:5738-48 (2010) 
 
Serine/threonine-protein kinase B-raf
Name:Serine/threonine-protein kinase B-raf
Type:Serine/threonine-protein kinase
Mol. Mass.:84446.00
Organism:Homo sapiens (Human)
Description:P15056
Residue:766
BDBM50323916
NameBDBM50323916
Synonyms:4-((4-methylpiperazin-1-yl)methyl)-N-(4-(2-morpholinoethoxy)naphthalen-1-yl)benzamide | CHEMBL1213923
TypeSmall organic molecule
Emp. Form.C29H36N4O3
Mol. Mass.488.6211
SMILESCN1CCN(Cc2ccc(cc2)C(=O)Nc2ccc(OCCN3CCOCC3)c3ccccc23)CC1