Reaction Details
TargetSerine/threonine-protein kinase B-raf
LigandBDBM50323919
Substrate/Competitorn/a
Meas. Tech.ChEMBL_647650 (CHEMBL1220001)
IC50 236.7±n/a nM
Citation Dietrich, JHulme, CHurley, LH The design, synthesis, and evaluation of 8 hybrid DFG-out allosteric kinase inhibitors: a structural analysis of the binding interactions of Gleevec, Nexavar, and BIRB-796. Bioorg Med Chem18:5738-48 (2010) 
 
Serine/threonine-protein kinase B-raf
Name:Serine/threonine-protein kinase B-raf
Type:Serine/threonine-protein kinase
Mol. Mass.:84446.00
Organism:Homo sapiens (Human)
Description:P15056
Residue:766
BDBM50323919
NameBDBM50323919
Synonyms:4-(4-(3-(3-tert-butyl-1-p-tolyl-1H-pyrazol-5-yl)ureido)phenoxy)-N-methylpicolinamide | CHEMBL1213974
TypeSmall organic molecule
Emp. Form.C28H30N6O3
Mol. Mass.498.5762
SMILESCNC(=O)c1cc(Oc2ccc(NC(=O)Nc3cc(nn3-c3ccc(C)cc3)C(C)(C)C)cc2)ccn1