Reaction Details
TargetSerine/threonine-protein kinase B-raf
LigandBDBM50323921
Substrate/Competitorn/a
Meas. Tech.ChEMBL_647650 (CHEMBL1220001)
IC50 92.3±n/a nM
Citation Dietrich, JHulme, CHurley, LH The design, synthesis, and evaluation of 8 hybrid DFG-out allosteric kinase inhibitors: a structural analysis of the binding interactions of Gleevec, Nexavar, and BIRB-796. Bioorg Med Chem18:5738-48 (2010) 
 
Serine/threonine-protein kinase B-raf
Name:Serine/threonine-protein kinase B-raf
Type:Serine/threonine-protein kinase
Mol. Mass.:84446.00
Organism:Homo sapiens (Human)
Description:P15056
Residue:766
BDBM50323921
NameBDBM50323921
Synonyms:1-(4-chloro-3-(trifluoromethyl)phenyl)-3-(4-(2-morpholinoethoxy)phenyl)urea | CHEMBL1213976
TypeSmall organic molecule
Emp. Form.C20H21ClF3N3O3
Mol. Mass.443.847
SMILESFC(F)(F)c1cc(NC(=O)Nc2ccc(OCCN3CCOCC3)cc2)ccc1Cl