Reaction Details
TargetMitogen-activated protein kinase 14
LigandBDBM50323915
Substrate/Competitorn/a
Meas. Tech.ChEMBL_647147 (CHEMBL1217288)
IC50 100000±n/a nM
Citation Dietrich, JHulme, CHurley, LH The design, synthesis, and evaluation of 8 hybrid DFG-out allosteric kinase inhibitors: a structural analysis of the binding interactions of Gleevec, Nexavar, and BIRB-796. Bioorg Med Chem18:5738-48 (2010) 
 
Mitogen-activated protein kinase 14
Name:Mitogen-activated protein kinase 14
Type:Serine/threonine-protein kinase
Mol. Mass.:41286.76
Organism:Homo sapiens (Human)
Description:Q16539
Residue:360
BDBM50323915
NameBDBM50323915
Synonyms:CHEMBL1213922 | N-methyl-4-(4-(4-((4-methylpiperazin-1-yl)methyl)benzamido)phenoxy)picolinamide
TypeSmall organic molecule
Emp. Form.C26H29N5O3
Mol. Mass.459.5402
SMILESCNC(=O)c1cc(Oc2ccc(NC(=O)c3ccc(CN4CCN(C)CC4)cc3)cc2)ccn1