Reaction Details
TargetCarbonic anhydrase 2
LigandBDBM10857
Substrate/Competitorn/a
Meas. Tech.ChEMBL_647169 (CHEMBL1217310)
Ki 240±n/a nM
Citation Kockar, FMaresca, AAydin, MIsik, STurkoglu, SSinan, SArslan, OGüler, OOTuran, YSupuran, CT Mutation of Phe91 to Asn in human carbonic anhydrase I unexpectedly enhanced both catalytic activity and affinity for sulfonamide inhibitors. Bioorg Med Chem18:5498-503 (2010) 
 
Carbonic anhydrase 2
Name:Carbonic anhydrase 2
Type:Enzyme
Mol. Mass.:29250.71
Organism:Homo sapiens (Human)
Description:P00918
Residue:260
BDBM10857
NameBDBM10857
Synonyms:4-aminobenzene-1-sulfonamide Sulfanilamide aromatic/heteroaromatic sulfonamide 2 | halogenosulfanilamide deriv. 5a
TypeSmall organic molecule
Emp. Form.C6H8N2O2S
Mol. Mass.172.205
SMILESNc1ccc(cc1)S(N)(=O)=O