Reaction Details
TargetMetabotropic glutamate receptor 5
LigandBDBM50323924
Substrate/Competitorn/a
Meas. Tech.ChEMBL_647203 (CHEMBL1217344)
Ki 20.3±n/a nM
Citation Baumann, CAMu, LWertli, NKrämer, SDHoner, MSchubiger, PAAmetamey, SM Syntheses and pharmacological characterization of novel thiazole derivatives as potential mGluR5 PET ligands. Bioorg Med Chem18:6044-54 (2010) 
 
Metabotropic glutamate receptor 5
Name:Metabotropic glutamate receptor 5
Type:Enzyme
Mol. Mass.:131900.14
Organism:Rattus norvegicus (Rat)
Description:P31424
Residue:1203
BDBM50323924
NameBDBM50323924
Synonyms:(E)-3-(Thiazol-2-ylethynyl)cyclohex-2-enone O-methyl oxime | CHEMBL1214361
TypeSmall organic molecule
Emp. Form.C12H12N2OS
Mol. Mass.232.301
SMILESCO\N=C1/CCCC(=C1)C#Cc1nccs1