Reaction Details
TargetSodium-dependent serotonin transporter
LigandBDBM50324246
Substrate/Competitorn/a
Meas. Tech.ChEMBL_649987 (CHEMBL1219685)
Ki 0.92±n/a nM
Citation Zhang, PCyriac, GKopajtic, TZhao, YJavitch, JAKatz, JLNewman, AH Structure-activity relationships for a novel series of citalopram (1-(3-(dimethylamino)propyl)-1-(4-fluorophenyl)-1,3-dihydroisobenzofuran-5-carbonitrile) analogues at monoamine transporters. J Med Chem53:6112-21 (2010) 
 
Sodium-dependent serotonin transporter
Name:Sodium-dependent serotonin transporter
Type:Multi-pass membrane protein
Mol. Mass.:70168.43
Organism:Rattus norvegicus (rat)
Description:P31652
Residue:630
BDBM50324246
NameBDBM50324246
Synonyms:(S)-(+)-3-(5-Bromo-1-(4-fluorophenyl)-1,3-dihydroisobenzofuran-1-yl)-N,N-dimethylpropan-1-amine | CHEMBL1214907
TypeSmall organic molecule
Emp. Form.C19H21BrFNO
Mol. Mass.378.279
SMILESCN(C)CCC[C@]1(OCc2cc(Br)ccc12)c1ccc(F)cc1