Reaction Details
TargetAurora kinase B
LigandBDBM50324279
Substrate/Competitorn/a
Meas. Tech.ChEMBL_650024 (CHEMBL1219722)
IC50 312±n/a nM
Citation Chiang, CCLin, YHLin, SFLai, CLLiu, CWei, WYYang, SCWang, RWTeng, LWChuang, SHChang, JMYuan, TTLee, YSChen, PChi, WKYang, JYHuang, HJLiao, CBHuang, JJ Discovery of pyrrole-indoline-2-ones as Aurora kinase inhibitors with a different inhibition profile. J Med Chem53:5929-41 (2010) 
 
Aurora kinase B
Name:Aurora kinase B
Type:Protein
Mol. Mass.:39327.72
Organism:Homo sapiens (Human)
Description:Q96GD4
Residue:344
BDBM50324279
NameBDBM50324279
Synonyms:(Z)-3-({3-[3-(Dimethylamino)propyl]-4-oxo-4,5,6,7-tetrahydro-1H-indol-2-yl}methylene)-5-(indolin-1-ylsulfonyl)indolin-2-one | CHEMBL1215348
TypeSmall organic molecule
Emp. Form.C30H32N4O4S
Mol. Mass.544.664
SMILESCN(C)CCCc1c(C=C2C(=O)Nc3ccc(cc23)S(=O)(=O)N2CCc3ccccc23)[nH]c2CCCC(=O)c12